SCM

R Development Page

Logfile for RcppEigen not available.

This package probably failed to build. See the build log for the source package:

Sun Nov 24 00:15:15 2013: Building tarball for package RcppEigen (SVN revision 4599)
using R version 3.0.2 Patched (2013-11-22 r64286) ...

* checking for file ‘RcppEigen/DESCRIPTION’ ... OK
* preparing ‘RcppEigen’:
* checking DESCRIPTION meta-information ... OK
* cleaning src
* running ‘cleanup’
* installing the package to build vignettes
      -----------------------------------
* installing *source* package ‘RcppEigen’ ...
** libs
g++ -I/srv/R/R-patched/build.13-11-23/include -DNDEBUG  -I/usr/local/include -I"/home/rforge/lib/R/3.0/Rcpp/include"  -I../inst/include -fpic  -g -O2  -c RcppEigen.cpp -o RcppEigen.o
In file included from ../inst/include/Eigen/Dense:1:0,
                 from ../inst/include/RcppEigenForward.h:29,
                 from ../inst/include/RcppEigen.h:25,
                 from RcppEigen.cpp:22:
../inst/include/Eigen/Core:308:26: fatal error: src/Core/Ref.h: No such file or directory
compilation terminated.
make: *** [RcppEigen.o] Error 1
g++ -I/srv/R/R-patched/build.13-11-23/include -DNDEBUG  -I/usr/local/include -I"/home/rforge/lib/R/3.0/Rcpp/include"  -I../inst/include -fpic  -g -O2  -c RcppEigen.cpp -o RcppEigen.o
In file included from ../inst/include/Eigen/Dense:1:0,
                 from ../inst/include/RcppEigenForward.h:29,
                 from ../inst/include/RcppEigen.h:25,
                 from RcppEigen.cpp:22:
../inst/include/Eigen/Core:308:26: fatal error: src/Core/Ref.h: No such file or directory
compilation terminated.
make: *** [RcppEigen.o] Error 1
ERROR: compilation failed for package ‘RcppEigen’
* removing ‘/tmp/RtmpYqgZcQ/Rinst2a22704db955/RcppEigen’
      -----------------------------------
ERROR: package installation failed
Run time: 5.42 seconds.
Thanks to:
Vienna University of Economics and Business University of Wisconsin - Madison Powered By FusionForge