SCM

R Development Page

RcppCImg log file (00install.out)

* installing *source* package ‘RcppCImg’ ...
** libs
g++ -I/srv/R/R-patched/build.13-02-14/include -DNDEBUG -I../inst/include/ -I/usr/local/include -I"/home/rforge/lib/R/2.15/Rcpp/include"   -fpic  -g -O2  -c RcppCImg.cpp -o RcppCImg.o
RcppCImg.cpp: In function ‘void _rcpp_module_CIMG_init()’:
RcppCImg.cpp:28:23: error: ‘init_1’ was not declared in this scope
RcppCImg.cpp:28:30: error: expected primary-expression before ‘const’
RcppCImg.cpp:29:23: error: ‘init_2’ was not declared in this scope
RcppCImg.cpp:29:30: error: expected primary-expression before ‘int’
RcppCImg.cpp:29:34: error: expected primary-expression before ‘int’
make: *** [RcppCImg.o] Error 1
g++ -I/srv/R/R-patched/build.13-02-14/include -DNDEBUG -I../inst/include/ -I/usr/local/include -I"/home/rforge/lib/R/2.15/Rcpp/include"   -fpic  -g -O2  -c RcppCImg.cpp -o RcppCImg.o
RcppCImg.cpp: In function ‘void _rcpp_module_CIMG_init()’:
RcppCImg.cpp:28:23: error: ‘init_1’ was not declared in this scope
RcppCImg.cpp:28:30: error: expected primary-expression before ‘const’
RcppCImg.cpp:29:23: error: ‘init_2’ was not declared in this scope
RcppCImg.cpp:29:30: error: expected primary-expression before ‘int’
RcppCImg.cpp:29:34: error: expected primary-expression before ‘int’
make: *** [RcppCImg.o] Error 1
ERROR: compilation failed for package ‘RcppCImg’
* removing ‘/mnt/building/build_2013-02-15-08-50/RF_PKG_CHECK/PKGS/RcppCImg.Rcheck/RcppCImg’
Thanks to:
Vienna University of Economics and Business University of Wisconsin - Madison Powered By FusionForge